Target
Alpha-1B adrenergic receptor
Ligand
BDBM50222935
Substrate
Meas. Tech.
ChEMBL_34478 (CHEMBL651233)
EC50
79±n/a nM
Citation
 Speake, JDNavas, FBishop, MJGarrison, DTBigham, ECHodson, SJSaussy, DLLiacos, JAIrving, PESherman, BW 2-(Anilinomethyl)imidazolines as alpha1 adrenergic receptor agonists: alpha1a subtype selective 2'-heteroaryl compounds. Bioorg Med Chem Lett 13:1183-6 (2003)  
Target
Name:
Alpha-1B adrenergic receptor
Synonyms:
ADA1B_HUMAN Adrenergic alpha1B Adrenergic receptor alpha Alpha 1B-adrenoreceptor | Alpha-1B adrenergic receptor
Type:
Enzyme
Mol. Mass.:
56862.13
Organism:
Homo sapiens (Human)
Description:
P35368
Residue:
520
  
Inhibitor
Name:
BDBM50222935
Synonyms:
CHEMBL275844
Type:
Small organic molecule
Emp. Form.:
C13H15N5
Mol. Mass.:
241.2917
SMILES:
C(Nc1ccccc1-c1cn[nH]c1)C1=NCCN1
: