Target
Alpha-1D adrenergic receptor
Ligand
BDBM50222910
Substrate
Meas. Tech.
ChEMBL_32580 (CHEMBL643418)
EC50
4±n/a nM
Citation
 Speake, JDNavas, FBishop, MJGarrison, DTBigham, ECHodson, SJSaussy, DLLiacos, JAIrving, PESherman, BW 2-(Anilinomethyl)imidazolines as alpha1 adrenergic receptor agonists: alpha1a subtype selective 2'-heteroaryl compounds. Bioorg Med Chem Lett 13:1183-6 (2003)  
Target
Name:
Alpha-1D adrenergic receptor
Synonyms:
ADA1D_HUMAN ADRA1D Adrenergic receptor alpha Alpha 1D-adrenoreceptor Alpha-1D adrenoceptor adrenergic Alpha1D
Type:
Enzyme Catalytic Domain
Mol. Mass.:
60485.82
Organism:
Homo sapiens (Human)
Description:
adrenergic Alpha1D ADRA1D HUMAN::P25100
Residue:
572
  
Inhibitor
Name:
BDBM50222910
Synonyms:
CHEMBL17491
Type:
Small organic molecule
Emp. Form.:
C12H14N6
Mol. Mass.:
242.2798
SMILES:
C(Nc1ccccc1-c1nc[nH]n1)C1=NCCN1
: