Target
Alpha-1D adrenergic receptor
Ligand
BDBM50421641
Substrate
Meas. Tech.
ChEBML_32587
IC50
40±n/a nM
Citation
 Speake, JDNavas, FBishop, MJGarrison, DTBigham, ECHodson, SJSaussy, DLLiacos, JAIrving, PESherman, BW 2-(Anilinomethyl)imidazolines as alpha1 adrenergic receptor agonists: alpha1a subtype selective 2'-heteroaryl compounds. Bioorg Med Chem Lett 13:1183-6 (2003)  
Target
Name:
Alpha-1D adrenergic receptor
Synonyms:
ADA1D_HUMAN ADRA1D Adrenergic receptor alpha Alpha 1D-adrenoreceptor Alpha-1D adrenoceptor adrenergic Alpha1D
Type:
Enzyme Catalytic Domain
Mol. Mass.:
60485.82
Organism:
Homo sapiens (Human)
Description:
adrenergic Alpha1D ADRA1D HUMAN::P25100
Residue:
572
  
Inhibitor
Name:
BDBM50421641
Synonyms:
CHEMBL277375
Type:
Small organic molecule
Emp. Form.:
C13H15N5
Mol. Mass.:
241.2917
SMILES:
C(Nc1ccccc1-c1cc[nH]n1)C1=NCCN1
: