Target
Beta-2 adrenergic receptor
Ligand
BDBM50421722
Substrate
Meas. Tech.
ChEMBL_37818 (CHEMBL651193)
Kd
1.1±n/a nM
Citation
 IJzerman, APAué, GHBultsma, TLinschoten, MRTimmerman, H Quantitative evaluation of the beta 2-adrenoceptor affinity of phenoxypropanolamines and phenylethanolamines. J Med Chem 28:1328-34 (1985)  
Target
Name:
Beta-2 adrenergic receptor
Synonyms:
ADRB2 Beta-2 adrenergic receptor Beta-2 adrenoreceptor | adrenergic Beta
Type:
Enzyme Catalytic Domain
Mol. Mass.:
47141.18
Organism:
BOVINE
Description:
adrenergic Beta ADRB2 BOVINE::Q28044
Residue:
418
  
Inhibitor
Name:
BDBM50421722
Synonyms:
CHEMBL1159890
Type:
Small organic molecule
Emp. Form.:
C15H21NO3
Mol. Mass.:
263.3321
SMILES:
CC(C)NCC(O)COc1ccccc1OCC#C
: