Target
Sigma non-opioid intracellular receptor 1
Ligand
BDBM50035097
Substrate
Meas. Tech.
ChEBML_201732
IC50
3.8±n/a nM
Citation
 Chambers, MSBaker, RBillington, DCKnight, AKMiddlemiss, DNWong, EH Spiropiperidines as high-affinity, selective sigma ligands. J Med Chem 35:2033-9 (1992)  
Target
Name:
Sigma non-opioid intracellular receptor 1
Synonyms:
Aging-associated gene 8 protein SGMR1_HUMAN SIGMAR1 SR31747-binding protein Sigma 1-type opioid receptor Sigma1R | hSigmaR1
Type:
Enzyme Catalytic Domain
Mol. Mass.:
25124.85
Organism:
Homo sapiens (Human)
Description:
Q99720
Residue:
223
  
Inhibitor
Name:
BDBM50035097
Synonyms:
1''-benzyl-3,4-dihydro-2H-spiro[naphthalene-1,4''-piperidine](L-687,384) 1''-benzylspiro[1,2,3,4-tetrahydronaphthalene-1,4''-(hexahydropyridine)] CHEMBL1256916 L-687384
Type:
Small organic molecule
Emp. Form.:
C21H25N
Mol. Mass.:
291.4299
SMILES:
C(N1CCC2(CCCc3ccccc23)CC1)c1ccccc1
: