Target
Adenosine receptor A1
Ligand
BDBM50007848
Substrate
Meas. Tech.
ChEMBL_27470 (CHEMBL642479)
Ki
42±n/a nM
Citation
 van der Wenden, EMIjzerman, APSoudijn, W A steric and electrostatic comparison of three models for the agonist/antagonist binding site on the adenosine A1 receptor. J Med Chem 35:629-35 (1992)  
Target
Name:
Adenosine receptor A1
Synonyms:
AA1R_RAT ADENOSINE A1 high Adenosine A1 receptor (A1) Adenosine receptors A1 | Adora1
Type:
Protein
Mol. Mass.:
36704.13
Organism:
Rattus norvegicus (rat)
Description:
Residue:
326
  
Inhibitor
Name:
BDBM50007848
Synonyms:
8-Cyclopropyl-1,3-dipropyl-3,7-dihydro-purine-2,6-dione | CHEMBL53737
Type:
Small organic molecule
Emp. Form.:
C14H20N4O2
Mol. Mass.:
276.3342
SMILES:
CCCn1c2nc([nH]c2c(=O)n(CCC)c1=O)C1CC1
: