Target
Adenosine receptor A1
Ligand
BDBM50367501
Substrate
Meas. Tech.
ChEMBL_27466 (CHEMBL642476)
IC50
2.0±n/a nM
Citation
 van der Wenden, EMIjzerman, APSoudijn, W A steric and electrostatic comparison of three models for the agonist/antagonist binding site on the adenosine A1 receptor. J Med Chem 35:629-35 (1992)  
Target
Name:
Adenosine receptor A1
Synonyms:
AA1R_RAT ADENOSINE A1 high Adenosine A1 receptor (A1) Adenosine receptors A1 | Adora1
Type:
Protein
Mol. Mass.:
36704.13
Organism:
Rattus norvegicus (rat)
Description:
Residue:
326
  
Inhibitor
Name:
BDBM50367501
Synonyms:
CHEMBL610427
Type:
Small organic molecule
Emp. Form.:
C16H16FN5O4
Mol. Mass.:
361.3277
SMILES:
OC[C@H]1OC([C@H](O)[C@@H]1O)n1cnc2c(Nc3ccc(F)cc3)ncnc12
: