Target
Adenosine receptor A1
Ligand
BDBM50421995
Substrate
Meas. Tech.
ChEMBL_27466 (CHEMBL642476)
IC50
27±n/a nM
Citation
 van der Wenden, EMIjzerman, APSoudijn, W A steric and electrostatic comparison of three models for the agonist/antagonist binding site on the adenosine A1 receptor. J Med Chem 35:629-35 (1992)  
Target
Name:
Adenosine receptor A1
Synonyms:
AA1R_RAT ADENOSINE A1 high Adenosine A1 receptor (A1) Adenosine receptors A1 | Adora1
Type:
Protein
Mol. Mass.:
36704.13
Organism:
Rattus norvegicus (rat)
Description:
Residue:
326
  
Inhibitor
Name:
BDBM50421995
Synonyms:
CHEMBL612221
Type:
Small organic molecule
Emp. Form.:
C17H19N5O4
Mol. Mass.:
357.3639
SMILES:
Cc1cccc(Nc2ncnc3n(cnc23)C2O[C@H](CO)[C@@H](O)[C@H]2O)c1
: