Target
5-hydroxytryptamine receptor 1D
Ligand
BDBM50422022
Substrate
Meas. Tech.
ChEMBL_1964 (CHEMBL617569)
IC50
20±n/a nM
Citation
 Castro, JLBaker, RGuiblin, ARHobbs, SCJenkins, MRRussell, MGBeer, MSStanton, JAScholey, KHargreaves, RJ Synthesis and biological activity of 3-[2-(dimethylamino)ethyl]-5-[(1,1-dioxo-5-methyl-1,2,5-thiadiazolidin- 2-yl)-methyl]-1H-indole and analogues: agonists for the 5-HT1D receptor. J Med Chem 37:3023-32 (1994)  
Target
Name:
5-hydroxytryptamine receptor 1D
Synonyms:
5HT1D_PIG Serotonin 1d (5-HT1d) receptor
Type:
PROTEIN
Mol. Mass.:
32680.56
Organism:
Sus scrofa
Description:
ChEMBL_1963
Residue:
291
  
Inhibitor
Name:
BDBM50422022
Synonyms:
CHEMBL101138
Type:
Small organic molecule
Emp. Form.:
C21H26N4O2S
Mol. Mass.:
398.522
SMILES:
CN(C)CCc1c[nH]c2ccc(cc12)N1CCN(Cc2ccccc2)S1(=O)=O
: