Target
Cholecystokinin receptor type A
Ligand
BDBM50449787
Substrate
Meas. Tech.
ChEMBL_49896 (CHEMBL661738)
IC50
1047±n/a nM
Citation
 Dezube, MSugg, EEBirkemo, LSCroom, DKDougherty, RWErvin, GNGrizzle, MKJames, MKJohnson, MFMosher, JT Modification of receptor selectivity and functional activity in cholecystokinin peptoid ligands. J Med Chem 38:3384-90 (1995)  
Target
Name:
Cholecystokinin receptor type A
Synonyms:
CCK-A receptor CCK1-R CCKAR_HUMAN Cholecystokinin receptor Cholecystokinin-1 Receptor
Type:
G Protein-Coupled Receptor (GPCR)
Mol. Mass.:
47859.34
Organism:
Homo sapiens (Human)
Description:
Stable expression of human CCK-1 receptors in HEK 293 cells.
Residue:
428
  
Inhibitor
Name:
BDBM50449787
Synonyms:
CHEMBL2062154 | PD-134308
Type:
Small organic molecule
Emp. Form.:
C35H42N4O6
Mol. Mass.:
614.7312
SMILES:
[H][C@@]12C[C@@]3([H])C[C@@]([H])(C1)C(OC(=O)N[C@](C)(Cc1c[nH]c4ccccc14)C(=O)NC[C@H](NC(=O)CCC(O)=O)c1ccccc1)[C@@]([H])(C2)C3
: