Target
Voltage-dependent L-type calcium channel subunit alpha-1D
Ligand
BDBM50422203
Substrate
Meas. Tech.
ChEMBL_92799 (CHEMBL703977)
IC50
29±n/a nM
Citation
 Corelli, FManetti, FTafi, ACampiani, GNacci, VBotta, M Diltiazem-like calcium entry blockers: a hypothesis of the receptor-binding site based on a comparative molecular field analysis model. J Med Chem 40:125-31 (1997)  
Target
Name:
Voltage-dependent L-type calcium channel subunit alpha-1D
Synonyms:
CAC1D_RAT Cacn4 Cacnl1a2 Cav1.3/Cav beta3/Cav alpha2delta complex RBD Voltage-dependent L-type calcium channel subunit alpha-1D Voltage-gated calcium channel subunit alpha Cav1.3
Type:
PROTEIN
Mol. Mass.:
250148.41
Organism:
Rattus norvegicus
Description:
ChEMBL_44709
Residue:
2203
  
Inhibitor
Name:
BDBM50422203
Synonyms:
CHEMBL284195
Type:
Small organic molecule
Emp. Form.:
C23H23ClN2O2S
Mol. Mass.:
426.959
SMILES:
CN(C)Cc1ccc2[C@H](OC(C)=O)[C@@H](Sc3c(Cl)cccc3-n12)c1ccccc1
: