Target
Alpha-1B adrenergic receptor
Ligand
BDBM50422378
Substrate
Meas. Tech.
ChEMBL_216970 (CHEMBL822788)
IC50
67608±n/a nM
Citation
 Bolognesi, MLMarucci, GAngeli, PBuccioni, MMinarini, ARosini, MTumiatti, VMelchiorre, C Analogues of prazosin that bear a benextramine-related polyamine backbone exhibit different antagonism toward alpha1-adrenoreceptor subtypes. J Med Chem 44:362-71 (2001)  
Target
Name:
Alpha-1B adrenergic receptor
Synonyms:
ADA1B_RAT Alpha 1B-adrenoceptor Alpha adrenergic receptor 1A and 1B Alpha-1Adrenoceptor Alpha-1B adrenoreceptor | adrenergic Alpha1B
Type:
G Protein-Coupled Receptor (GPCR)
Mol. Mass.:
56606.71
Organism:
Rattus norvegicus (rat)
Description:
Receptor binding assays were performed using rat cortical membranes.
Residue:
515
  
Inhibitor
Name:
BDBM50422378
Synonyms:
CHEMBL122621
Type:
Small organic molecule
Emp. Form.:
C32H54N4O2S2
Mol. Mass.:
590.927
SMILES:
COc1cccc(CNCCCCCCNCCSSCCNCCCCCCNCc2ccccc2OC)c1
: