Target
Alpha-1D adrenergic receptor
Ligand
BDBM50422379
Substrate
Meas. Tech.
ChEMBL_216972 (CHEMBL822790)
IC50
27±n/a nM
Citation
 Bolognesi, MLMarucci, GAngeli, PBuccioni, MMinarini, ARosini, MTumiatti, VMelchiorre, C Analogues of prazosin that bear a benextramine-related polyamine backbone exhibit different antagonism toward alpha1-adrenoreceptor subtypes. J Med Chem 44:362-71 (2001)  
Target
Name:
Alpha-1D adrenergic receptor
Synonyms:
ADA1D_RAT Adra1d Alpha-1D adrenergic receptor | Serotonin 1a (5-HT1a) receptor/Adrenergic receptor alpha-1
Type:
Protein
Mol. Mass.:
59375.97
Organism:
Rattus norvegicus (Rat)
Description:
P23944
Residue:
561
  
Inhibitor
Name:
BDBM50422379
Synonyms:
CHEMBL263289
Type:
Small organic molecule
Emp. Form.:
C60H84N14O6S2
Mol. Mass.:
1161.529
SMILES:
COc1cc2nc(nc(N)c2cc1OC)N1CCN(CC1)C(=O)c1ccccc1CNCCCCCCNCCSSCCNCCCCCCNCc1ccccc1C(=O)N1CCN(CC1)c1nc(N)c2cc(OC)c(OC)cc2n1
: