Target
Alpha-1B adrenergic receptor
Ligand
BDBM50422382
Substrate
Meas. Tech.
ChEMBL_216970 (CHEMBL822788)
IC50
1862±n/a nM
Citation
 Bolognesi, MLMarucci, GAngeli, PBuccioni, MMinarini, ARosini, MTumiatti, VMelchiorre, C Analogues of prazosin that bear a benextramine-related polyamine backbone exhibit different antagonism toward alpha1-adrenoreceptor subtypes. J Med Chem 44:362-71 (2001)  
Target
Name:
Alpha-1B adrenergic receptor
Synonyms:
ADA1B_RAT Alpha 1B-adrenoceptor Alpha adrenergic receptor 1A and 1B Alpha-1Adrenoceptor Alpha-1B adrenoreceptor | adrenergic Alpha1B
Type:
G Protein-Coupled Receptor (GPCR)
Mol. Mass.:
56606.71
Organism:
Rattus norvegicus (rat)
Description:
Receptor binding assays were performed using rat cortical membranes.
Residue:
515
  
Inhibitor
Name:
BDBM50422382
Synonyms:
CHEMBL1203233
Type:
Small organic molecule
Emp. Form.:
C68H104N14O6S2
Mol. Mass.:
1277.774
SMILES:
COc1cc2nc(nc(N)c2cc1OC)N(C)CCCCCCN(C)C(=O)c1ccccc1CNCCCCCCNCCSSCCNCCCCCCNCc1ccccc1C(=O)N(C)CCCCCCN(C)c1nc(N)c2cc(OC)c(OC)cc2n1
: