Target
Beta-1 adrenergic receptor
Ligand
BDBM50027811
Substrate
Meas. Tech.
ChEMBL_41530 (CHEMBL654937)
EC50
794±n/a nM
Citation
 Uehling, DEDonaldson, KHDeaton, DNHyman, CESugg, EEBarrett, DGHughes, RGReitter, BAdkison, KKLancaster, MELee, FHart, RPaulik, MASherman, BWTrue, TCowan, C Synthesis and evaluation of potent and selective beta(3) adrenergic receptor agonists containing acylsulfonamide, sulfonylsulfonamide, and sulfonylurea carboxylic acid isosteres. J Med Chem 45:567-83 (2002)  
Target
Name:
Beta-1 adrenergic receptor
Synonyms:
ADRB1 ADRB1_HUMAN Beta-1 adrenoceptor | adrenergic Beta1
Type:
G Protein-Coupled Receptor (GPCR)
Mol. Mass.:
51338.40
Organism:
Homo sapiens (Human)
Description:
P08588
Residue:
477
  
Inhibitor
Name:
BDBM50027811
Synonyms:
CHEMBL422876
Type:
Small organic molecule
Emp. Form.:
C26H30ClN3O4S
Mol. Mass.:
516.052
SMILES:
C[C@H](CNc1ccc(CCS(=O)(=O)NC(=O)c2ccccc2)cc1)NC[C@H](O)c1cccc(Cl)c1
: