Target
Beta-3 adrenergic receptor
Ligand
BDBM50027821
Substrate
Meas. Tech.
ChEMBL_41705 (CHEMBL654147)
EC50
0.79±n/a nM
Citation
 Uehling, DEDonaldson, KHDeaton, DNHyman, CESugg, EEBarrett, DGHughes, RGReitter, BAdkison, KKLancaster, MELee, FHart, RPaulik, MASherman, BWTrue, TCowan, C Synthesis and evaluation of potent and selective beta(3) adrenergic receptor agonists containing acylsulfonamide, sulfonylsulfonamide, and sulfonylurea carboxylic acid isosteres. J Med Chem 45:567-83 (2002)  
Target
Name:
Beta-3 adrenergic receptor
Synonyms:
ADRB3 ADRB3_HUMAN Beta-2 adrenergic receptor and beta-3 adrenergic receptor Beta-3 adrenoreceptor | adrenergic Beta3
Type:
G Protein-Coupled Receptor (GPCR)
Mol. Mass.:
43534.88
Organism:
Homo sapiens (Human)
Description:
Residue:
408
  
Inhibitor
Name:
BDBM50027821
Synonyms:
CHEMBL347616
Type:
Small organic molecule
Emp. Form.:
C25H28ClN3O4S
Mol. Mass.:
502.026
SMILES:
C[C@H](CNc1ccc(CC(=O)NS(=O)(=O)c2ccccc2)cc1)NC[C@H](O)c1cccc(Cl)c1
: