Target
Prostaglandin G/H synthase 2
Ligand
BDBM50422572
Substrate
Meas. Tech.
ChEMBL_307272 (CHEMBL831657)
IC50
338844±n/a nM
Citation
 Prasanna, SManivannan, EChaturvedi, SC Quantitative structure-activity relationship analysis of a series of 2,3-diaryl benzopyran analogues as novel selective cyclooxygenase-2 inhibitors. Bioorg Med Chem Lett 14:4005-11 (2004)  
Target
Name:
Prostaglandin G/H synthase 2
Synonyms:
Cox-2 Cyclooxygenase-2 Glucocorticoid-regulated inflammatory cyclooxygenase Macrophage activation-associated marker protein P71/73 PGH synthase 2 PGHS-2 Pghs-b Prostaglandin H2 synthase 2 Ptgs2 Tis10
Type:
Protein
Mol. Mass.:
69020.39
Organism:
Mus musculus (Mouse)
Description:
Q05769
Residue:
604
  
Inhibitor
Name:
BDBM50422572
Synonyms:
CHEMBL336206
Type:
Small organic molecule
Emp. Form.:
C22H15ClO4S
Mol. Mass.:
410.87
SMILES:
CS(=O)(=O)c1ccc(cc1)-c1oc2ccccc2c(=O)c1-c1ccc(Cl)cc1
: