Target
Integrin alpha-4/beta-1
Ligand
BDBM50157458
Substrate
Meas. Tech.
ChEMBL_306909 (CHEMBL828352)
IC50
0.250000±n/a nM
Citation
 Hoshina, YIkegami, SOkuyama, AFukui, HInoguchi, KMaruyama, TFujimoto, KMatsumura, YAoyama, AHarada, TTanaka, HNakamura, T 2,3-Diphenylpropionic acids as potent VLA-4 antagonists. Bioorg Med Chem Lett 15:217-20 (2004)  
Target
Name:
Integrin alpha-4/beta-1
Synonyms:
Fibronectin receptor beta/Integrin alpha-4 | Integrin alpha-4/beta-1
Type:
Mol. Mass.:
Description:
ASSAY_ID of EBI is 88912
Components:
This complex has 2 components.
Component 1
Name:
Integrin beta-1
Synonyms:
CD_antigen=CD29 Fibronectin receptor beta GPIIA ITGB1 MDF2 | MSK12
Type:
Enzyme
Mol. Mass.:
88400.38
Organism:
Homo sapiens (Human)
Description:
P05556
Residue:
798
  
Component 2
Name:
Integrin alpha-4
Synonyms:
CD49 antigen-like family member D CD49d antigen ITA4_HUMAN Integrin alpha-4 Integrin alpha-IV VLA-4 integrin alpha 4 precursor | integrin alpha-4 precursor
Type:
Membrane Protein
Mol. Mass.:
114897.35
Organism:
Homo sapiens (Human)
Description:
P13612
Residue:
1032
  
Inhibitor
Name:
BDBM50157458
Synonyms:
3-{4-[(3,5-Dichloro-pyridine-4-carbonyl)-amino]-phenyl}-2-{3-[(2,2-dimethyl-propionyl)-isobutyl-amino]-4-ethoxy-phenyl}-propionic acid | CHEMBL181321
Type:
Small organic molecule
Emp. Form.:
C32H37Cl2N3O5
Mol. Mass.:
614.559
SMILES:
CCOc1ccc(cc1N(CC(C)C)C(=O)C(C)(C)C)C(Cc1ccc(NC(=O)c2c(Cl)cncc2Cl)cc1)C(O)=O
: