Target
Prostaglandin G/H synthase 2
Ligand
BDBM50288327
Substrate
Meas. Tech.
ChEMBL_307256 (CHEMBL875560)
IC50
457±n/a nM
Citation
 Prasanna, SManivannan, EChaturvedi, SC QSAR analyses of conformationally restricted 1,5-diaryl pyrazoles as selective COX-2 inhibitors: application of connection table representation of ligands. Bioorg Med Chem Lett 15:2097-102 (2005)  
Target
Name:
Prostaglandin G/H synthase 2
Synonyms:
COX2 Cyclooxygenase 2 (COX-2) Cyclooxygenase-2 (COX-2 AA) Cyclooxygenase-2 (COX-2) PGH2_HUMAN PHS II Prostaglandin E synthase/G/H synthase 2 Prostaglandin-endoperoxide synthase 2
Type:
Enzyme
Mol. Mass.:
69003.89
Organism:
Homo sapiens (Human)
Description:
Recombinant Cox-2 provided by Cayman (Cayman Chemical Co.,Ann Arbor, MI).
Residue:
604
  
Inhibitor
Name:
BDBM50288327
Synonyms:
4-(3-Trifluoromethyl-4H-thiochromeno[4,3-c]pyrazol-1-yl)-benzenesulfonamide | CHEMBL273420
Type:
Small organic molecule
Emp. Form.:
C17H12F3N3O2S2
Mol. Mass.:
411.421
SMILES:
NS(=O)(=O)c1ccc(cc1)-n1nc(c2CSc3ccccc3-c12)C(F)(F)F
: