Target
Acetylcholinesterase
Ligand
BDBM8994
Substrate
Meas. Tech.
ChEMBL_307248 (CHEMBL829154)
IC50
5248±n/a nM
Citation
 Martín-Santamaría, SMuñoz-Muriedas, JLuque, FJGago, F Modulation of binding strength in several classes of active site inhibitors of acetylcholinesterase studied by comparative binding energy analysis. J Med Chem 47:4471-82 (2004)  
Target
Name:
Acetylcholinesterase
Synonyms:
ACES_HUMAN Acetylcholinesterase (AChE) | Acetylcholinesterase (human AChE)
Type:
Enzyme
Mol. Mass.:
67792.70
Organism:
Homo sapiens (Human)
Description:
P22303
Residue:
614
  
Inhibitor
Name:
BDBM8994
Synonyms:
6,7-dimethoxy-1,2,3,4-tetrahydroacridin-9-amine | Tacrine Analogue 11
Type:
Small organic molecule
Emp. Form.:
C15H18N2O2
Mol. Mass.:
258.3156
SMILES:
COc1cc2nc3CCCCc3c(N)c2cc1OC
: