Target
Somatostatin receptor type 1
Ligand
BDBM50423334
Substrate
Meas. Tech.
ChEMBL_456104 (CHEMBL888113)
Kd
2.8±n/a nM
Citation
 Hurth, KEnz, AFloersheim, PGentsch, CHoyer, DLangenegger, DNeumann, PPfäffli, PSorg, DSwoboda, RVassout, ATroxler, T SAR of the arylpiperazine moiety of obeline somatostatin sst1 receptor antagonists. Bioorg Med Chem Lett 17:3988-91 (2007)  
Target
Name:
Somatostatin receptor type 1
Synonyms:
SOMATOSTATIN SST1 SS1R Somatostatin receptor Sstr1
Type:
Enzyme Catalytic Domain
Mol. Mass.:
42752.93
Organism:
RAT
Description:
SOMATOSTATIN SST1 SSTR1 RAT::P28646
Residue:
391
  
Inhibitor
Name:
BDBM50423334
Synonyms:
CHEMBL400136
Type:
Small organic molecule
Emp. Form.:
C27H31FN4O2
Mol. Mass.:
462.559
SMILES:
COc1cccc2C[C@@H]3[C@H](C[C@H](CN3C)C(=O)N3CCN(CC3)c3cccc(F)c3C#N)Cc12
: