Target
P2Y purinoceptor 12
Ligand
BDBM50423387
Substrate
Meas. Tech.
ChEMBL_457631 (CHEMBL923908)
IC50
0.50±n/a nM
Citation
 Springthorpe, BBailey, ABarton, PBirkinshaw, TNBonnert, RVBrown, RCChapman, DDixon, JGuile, SDHumphries, RGHunt, SFInce, FIngall, AHKirk, IPLeeson, PDLeff, PLewis, RJMartin, BPMcGinnity, DFMortimore, MPPaine, SWPairaudeau, GPatel, ARigby, AJRiley, RJTeobald, BJTomlinson, WWebborn, PJWillis, PA From ATP to AZD6140: the discovery of an orally active reversible P2Y12 receptor antagonist for the prevention of thrombosis. Bioorg Med Chem Lett 17:6013-8 (2007)  
Target
Name:
P2Y purinoceptor 12
Synonyms:
ADP-glucose receptor HORK3 P2T(AC) P2Y(AC) P2Y(cyc) P2Y12 platelet ADP receptor Purinergic receptor P2Y12 | SP1999
Type:
Enzyme
Mol. Mass.:
39458.48
Organism:
Homo sapiens (Human)
Description:
Q9H244
Residue:
342
  
Inhibitor
Name:
BDBM50423387
Synonyms:
CHEMBL437204
Type:
Small organic molecule
Emp. Form.:
C23H33N7O7S
Mol. Mass.:
551.616
SMILES:
CCCCNc1nc(SCCC)nc2n(nnc12)[C@@H]1C[C@H](\C=C\C(=O)N[C@@H](CC(O)=O)C(O)=O)[C@@H](O)[C@H]1O
: