Target
Matrix metalloproteinase-9
Ligand
BDBM11343
Substrate
Meas. Tech.
ChEMBL_458932 (CHEMBL924951)
Ki
27±n/a nM
Citation
 Verma, RPHansch, C Matrix metalloproteinases (MMPs): chemical-biological functions and (Q)SARs. Bioorg Med Chem 15:2223-68 (2007)  
Target
Name:
Matrix metalloproteinase-9
Synonyms:
67 kDa matrix metalloproteinase-9 92 kDa gelatinase CLG4B Gelatinase B MMP9 Matrix metalloproteinase 9 (MMP-9) Matrix metalloproteinase-9 (MMP9)
Type:
Enzyme
Mol. Mass.:
78452.28
Organism:
Homo sapiens (Human)
Description:
P14780
Residue:
707
  
Inhibitor
Name:
BDBM11343
Synonyms:
(2S)-2-[benzyl(4-methoxybenzene)sulfonamido]-N-hydroxy-3-methylbutanamide N-4-Methoxyphenylsulfonyl-N-benzyl-L-valine hydroxamate
Type:
Small organic molecule
Emp. Form.:
C19H24N2O5S
Mol. Mass.:
392.469
SMILES:
COc1ccc(cc1)S(=O)(=O)N(Cc1ccccc1)[C@@H](C(C)C)C(=O)NO
: