Target
Matrix metalloproteinase-9
Ligand
BDBM50086781
Substrate
Meas. Tech.
ChEMBL_458932 (CHEMBL924951)
Ki
0.603000±n/a nM
Citation
 Verma, RPHansch, C Matrix metalloproteinases (MMPs): chemical-biological functions and (Q)SARs. Bioorg Med Chem 15:2223-68 (2007)  
Target
Name:
Matrix metalloproteinase-9
Synonyms:
67 kDa matrix metalloproteinase-9 92 kDa gelatinase CLG4B Gelatinase B MMP9 Matrix metalloproteinase 9 (MMP-9) Matrix metalloproteinase-9 (MMP9)
Type:
Enzyme
Mol. Mass.:
78452.28
Organism:
Homo sapiens (Human)
Description:
P14780
Residue:
707
  
Inhibitor
Name:
BDBM50086781
Synonyms:
2-(N-(4-nitrobenzyl)-2,3,4,5,6-pentafluorophenylsulfonamido)-N-hydroxypropanamide N-Hydroxy-2-[(4-nitro-benzyl)-pentafluorobenzenesulfonyl-amino]-propionamide
Type:
Small organic molecule
Emp. Form.:
C16H12F5N3O6S
Mol. Mass.:
469.34
SMILES:
CC(N(Cc1ccc(cc1)[N+]([O-])=O)S(=O)(=O)c1c(F)c(F)c(F)c(F)c1F)C(=O)NO
: