Target
Collagenase 3
Ligand
BDBM50160843
Substrate
Meas. Tech.
ChEMBL_458933 (CHEMBL924952)
Ki
0.331000±n/a nM
Citation
 Verma, RPHansch, C Matrix metalloproteinases (MMPs): chemical-biological functions and (Q)SARs. Bioorg Med Chem 15:2223-68 (2007)  
Target
Name:
Collagenase 3
Synonyms:
MMP-13 MMP13_HUMAN Matrix metalloproteinase-13 (MMP-13) | Matrix metalloproteinase-13 (MMP13)
Type:
Enzyme
Mol. Mass.:
53808.06
Organism:
Homo sapiens (Human)
Description:
P45452
Residue:
471
  
Inhibitor
Name:
BDBM50160843
Synonyms:
1-[4-(4-Phenoxy-phenoxy)-phenyl]-1,7,9-triaza-spiro[4.5]decane-2,6,8,10-tetraone | CHEMBL178163
Type:
Small organic molecule
Emp. Form.:
C25H19N3O6
Mol. Mass.:
457.4349
SMILES:
O=C1CCC2(N1c1ccc(Oc3ccc(Oc4ccccc4)cc3)cc1)C(=O)NC(=O)NC2=O
: