Target
72 kDa type IV collagenase
Ligand
BDBM50086801
Substrate
Meas. Tech.
ChEMBL_458931 (CHEMBL924950)
Ki
1.4±n/a nM
Citation
 Verma, RPHansch, C Matrix metalloproteinases (MMPs): chemical-biological functions and (Q)SARs. Bioorg Med Chem 15:2223-68 (2007)  
Target
Name:
72 kDa type IV collagenase
Synonyms:
72 kDa gelatinase CLG4A Gelatinase A (MMP-2) MMP2_HUMAN Matrix metalloproteinase-2 (MMP 2) Matrix metalloproteinases 2 (MMP-2) | TBE-1
Type:
Enzyme
Mol. Mass.:
73870.36
Organism:
Homo sapiens (Human)
Description:
P08253
Residue:
660
  
Inhibitor
Name:
BDBM50086801
Synonyms:
2-(N-(4-nitrobenzyl)-2,2,12,12,15,15,18,18,18-nonafluorobutan-2-ylsulfonamido)-N-hydroxypropanamide N-Hydroxy-2-[(4-nitro-benzyl)-(nonafluorobutane-1-sulfonyl)-amino]-propionamide
Type:
Small organic molecule
Emp. Form.:
C14H12F9N3O6S
Mol. Mass.:
521.312
SMILES:
CC(N(Cc1ccc(cc1)[N+]([O-])=O)S(=O)(=O)C(F)(F)C(F)(F)C(F)(F)C(F)(F)F)C(=O)NO
: