Target
Somatostatin receptor type 2
Ligand
BDBM50423463
Substrate
Meas. Tech.
ChEMBL_461986 (CHEMBL944829)
Kd
13183±n/a nM
Citation
 Troxler, TEnz, AHoyer, DLangenegger, DNeumann, PPfäffli, PSchoeffter, PHurth, K Ergoline derivatives as highly potent and selective antagonists at the somatostatin sst 1 receptor. Bioorg Med Chem Lett 18:979-82 (2008)  
Target
Name:
Somatostatin receptor type 2
Synonyms:
SOMATOSTATIN SST2 SS2R Somatostatin receptor Somatostatin receptor type 2 | Sstr2
Type:
Enzyme Catalytic Domain
Mol. Mass.:
41212.21
Organism:
RAT
Description:
SOMATOSTATIN SST2 SSTR2 RAT::P30680
Residue:
369
  
Inhibitor
Name:
BDBM50423463
Synonyms:
CHEMBL254287
Type:
Small organic molecule
Emp. Form.:
C27H29BrF2N4O
Mol. Mass.:
543.446
SMILES:
CCN1C[C@@H](C[C@H]2[C@H]1Cc1c(Br)[nH]c3cccc2c13)C(=O)N1CCN(CC1)c1ccc(F)c(F)c1
: