Target
Somatostatin receptor type 1
Ligand
BDBM50423471
Substrate
Meas. Tech.
ChEMBL_461985 (CHEMBL944828)
Kd
0.759000±n/a nM
Citation
 Troxler, TEnz, AHoyer, DLangenegger, DNeumann, PPfäffli, PSchoeffter, PHurth, K Ergoline derivatives as highly potent and selective antagonists at the somatostatin sst 1 receptor. Bioorg Med Chem Lett 18:979-82 (2008)  
Target
Name:
Somatostatin receptor type 1
Synonyms:
SOMATOSTATIN SST1 SS1R Somatostatin receptor Sstr1
Type:
Enzyme Catalytic Domain
Mol. Mass.:
42752.93
Organism:
RAT
Description:
SOMATOSTATIN SST1 SSTR1 RAT::P28646
Residue:
391
  
Inhibitor
Name:
BDBM50423471
Synonyms:
CHEMBL254288
Type:
Small organic molecule
Emp. Form.:
C26H31N5O2
Mol. Mass.:
445.5566
SMILES:
CN1C[C@@H](C[C@H]2[C@H]1Cc1c[nH]c3cccc2c13)C(=O)N1CCN(CC1)c1cccc(=O)n1C
: