Target
Sex hormone-binding globulin
Ligand
BDBM50423516
Substrate
Meas. Tech.
ChEMBL_466706 (CHEMBL922711)
Kd
5.9±n/a nM
Citation
 Cherkasov, ABan, FSantos-Filho, OThorsteinson, NFallahi, MHammond, GL An updated steroid benchmark set and its application in the discovery of novel nanomolar ligands of sex hormone-binding globulin. J Med Chem 51:2047-56 (2008)  
Target
Name:
Sex hormone-binding globulin
Synonyms:
SHBG Testis-specific androgen-binding protein
Type:
PROTEIN
Mol. Mass.:
43780.19
Organism:
Homo sapiens (Human)
Description:
ChEMBL_466706
Residue:
402
  
Inhibitor
Name:
BDBM50423516
Synonyms:
ETONOGESTREL Nexplanon | ORG-3236
Type:
Small organic molecule
Emp. Form.:
C22H28O2
Mol. Mass.:
324.4565
SMILES:
CC[C@]12CC(=C)[C@H]3[C@@H](CCC4=CC(=O)CC[C@H]34)[C@@H]1CC[C@@]2(O)C#C
: