Target
Albumin
Ligand
BDBM50027886
Substrate
Meas. Tech.
ChEMBL_475196 (CHEMBL925737)
Kd
6026±n/a nM
Citation
 Lázaro, ELowe, PJBriand, XFaller, B New approach to measure protein binding based on a parallel artificial membrane assay and human serum albumin. J Med Chem 51:2009-17 (2008)  
Target
Name:
Albumin
Synonyms:
ALB Serum albumin
Type:
PROTEIN
Mol. Mass.:
69362.94
Organism:
Homo sapiens (Human)
Description:
ChEMBL_1509401
Residue:
609
  
Inhibitor
Name:
BDBM50027886
Synonyms:
1-Butyl-3-(p-methylphenylsulfonyl)urea 1-Butyl-3-tosylurea N-(4-Methylphenylsulfonyl)-N'-butylurea N-Butyl-N'-(p-tolylsulfonyl)urea N-n-Butyl-N'-tosylurea TOLBUTAMIDE
Type:
Small organic molecule
Emp. Form.:
C12H18N2O3S
Mol. Mass.:
270.348
SMILES:
CCCCNC(=O)NS(=O)(=O)c1ccc(C)cc1
: