Target
Urease
Ligand
BDBM35539
Substrate
Meas. Tech.
ChEMBL_478538 (CHEMBL923500)
IC50
67608±n/a nM
Citation
 Zaheer-ul-Haq, naLodhi, MAAhmad Nawaz, SIqbal, SMohammed Khan, KRode, BMAtta-ur-Rahman, AChoudhary, MI 3D-QSAR CoMFA studies on bis-coumarine analogues as urease inhibitors: a strategic design in anti-urease agents. Bioorg Med Chem 16:3456-61 (2008)  
Target
Name:
Urease
Synonyms:
UREA_CANEN | Urea amidohydrolase
Type:
Enzyme
Mol. Mass.:
90746.20
Organism:
Canavalia ensiformis (Jack bean) (Horse bean)
Description:
P07374
Residue:
840
  
Inhibitor
Name:
BDBM35539
Synonyms:
symmetric dicoumarol analogue, 15
Type:
Small organic molecule
Emp. Form.:
C22H18O6
Mol. Mass.:
378.3747
SMILES:
CCCC(c1c(O)c2ccccc2oc1=O)c1c(O)c2ccccc2oc1=O
: