Target
Integrin alpha-5/beta-1
Ligand
BDBM50423723
Substrate
Meas. Tech.
ChEMBL_605949 (CHEMBL1068566)
IC50
46±n/a nM
Citation
 Zischinsky, GOsterkamp, FVossmeyer, DZahn, GScharn, DZwintscher, AStragies, R Discovery of orally available integrin alpha5beta1 antagonists. Bioorg Med Chem Lett 20:380-2 (2010)  
Target
Name:
Integrin alpha-5/beta-1
Synonyms:
Fibronectin receptor alpha/beta ITGA5/ITGB1
Type:
Enzyme
Mol. Mass.:
Description:
Components:
This complex has 2 components.
Component 1
Name:
Integrin alpha-5
Synonyms:
CD49 antigen-like family member E FNRA Fibronectin receptor subunit alpha ITGA5 Integrin alpha-F | VLA-5
Type:
Single-pass type I membrane protein
Mol. Mass.:
114523.00
Organism:
Homo sapiens (Human)
Description:
Residue:
1049
  
Component 2
Name:
Integrin beta-1
Synonyms:
CD_antigen=CD29 Fibronectin receptor beta GPIIA ITGB1 MDF2 | MSK12
Type:
Enzyme
Mol. Mass.:
88400.38
Organism:
Homo sapiens (Human)
Description:
P05556
Residue:
798
  
Inhibitor
Name:
BDBM50423723
Synonyms:
CHEMBL593702
Type:
Small organic molecule
Emp. Form.:
C30H31N3O3S
Mol. Mass.:
513.65
SMILES:
Cc1ccnc(NCc2csc(c2)-c2ccc(C[C@H](NC(=O)c3c(C)cc(C)cc3C)C(O)=O)cc2)c1
: