Target
Integrin alpha-V/beta-5
Ligand
BDBM50423726
Substrate
Meas. Tech.
ChEMBL_605951 (CHEMBL1069895)
IC50
347±n/a nM
Citation
 Zischinsky, GOsterkamp, FVossmeyer, DZahn, GScharn, DZwintscher, AStragies, R Discovery of orally available integrin alpha5beta1 antagonists. Bioorg Med Chem Lett 20:380-2 (2010)  
Target
Name:
Integrin alpha-V/beta-5
Synonyms:
ITGAV/ITGB5 | Integrin beta-5/Vitronectin receptor alpha
Type:
Enzyme
Mol. Mass.:
Description:
Components:
This complex has 2 components.
Component 1
Name:
Integrin alpha-V
Synonyms:
ITAV_HUMAN Integrin alpha-V/alpha-5 VNRA Vitronectin receptor | Vitronectin receptor subunit alpha
Type:
PROTEIN
Mol. Mass.:
116024.92
Organism:
Homo sapiens (Human)
Description:
ChEMBL_582336
Residue:
1048
  
Component 2
Name:
Integrin beta-5
Synonyms:
ITB5_HUMAN | ITGB5
Type:
PROTEIN
Mol. Mass.:
88047.37
Organism:
Homo sapiens (Human)
Description:
EBI_10915
Residue:
799
  
Inhibitor
Name:
BDBM50423726
Synonyms:
CHEMBL594161
Type:
Small organic molecule
Emp. Form.:
C28H30N6O3
Mol. Mass.:
498.5762
SMILES:
Cc1ccnc(NCc2cn(nn2)-c2ccc(C[C@H](NC(=O)c3c(C)cc(C)cc3C)C(O)=O)cc2)c1
: