Target
Cyclin-dependent kinase 6/G1/S-specific cyclin-D1
Ligand
BDBM50423729
Substrate
Meas. Tech.
ChEMBL_606614 (CHEMBL1071250)
IC50
691000±n/a nM
Citation
 Klein, MAMayo, KHKratzke, RA p16(INK4a) Peptide mimetics identified via virtual screening. Bioorg Med Chem Lett 20:403-5 (2010)  
Target
Name:
Cyclin-dependent kinase 6/G1/S-specific cyclin-D1
Synonyms:
CDK6/cyclin D1 | Cyclin-dependent kinase 6/G1/S-specific cyclin D1
Type:
Mol. Mass.:
Description:
ASSAY_ID of ChEMBL is 1935149
Components:
This complex has 2 components.
Component 1
Name:
G1/S-specific cyclin-D1
Synonyms:
B-cell lymphoma 1 protein BCL-1 oncogene CCND1 PRAD1 | PRAD1 oncogene
Type:
Enzyme Subunit
Mol. Mass.:
33717.70
Organism:
Homo sapiens (Human)
Description:
Residue:
295
  
Component 2
Name:
Cyclin-dependent kinase 6
Synonyms:
CDK6 CDKN6 Cyclin-dependent kinase 6 (CDK 6) | Serine/threonine-protein kinase PLSTIRE
Type:
Enzyme Subunit
Mol. Mass.:
36937.42
Organism:
Homo sapiens (Human)
Description:
Q00534
Residue:
326
  
Inhibitor
Name:
BDBM50423729
Synonyms:
CHEMBL611633 | NCI-14893
Type:
Small organic molecule
Emp. Form.:
C22H35N3O2
Mol. Mass.:
373.5322
SMILES:
COc1cc(NC[C@](C)(O)N(CC(C)C)CC(C)C)c2nc(C)ccc2c1
: