Target
Integrin alpha-4/beta-1
Ligand
BDBM50326000
Substrate
Meas. Tech.
ChEMBL_660937 (CHEMBL1249604)
IC50
0.022000±n/a nM
Citation
 Peng, LLiu, RMarik, JWang, XTakada, YLam, KS Combinatorial chemistry identifies high-affinity peptidomimetics against alpha4beta1 integrin for in vivo tumor imaging. Nat Chem Biol 2:381-9 (2006)  
Target
Name:
Integrin alpha-4/beta-1
Synonyms:
Fibronectin receptor beta/Integrin alpha-4 | Integrin alpha-4/beta-1
Type:
Mol. Mass.:
Description:
ASSAY_ID of EBI is 88912
Components:
This complex has 2 components.
Component 1
Name:
Integrin beta-1
Synonyms:
CD_antigen=CD29 Fibronectin receptor beta GPIIA ITGB1 MDF2 | MSK12
Type:
Enzyme
Mol. Mass.:
88400.38
Organism:
Homo sapiens (Human)
Description:
P05556
Residue:
798
  
Component 2
Name:
Integrin alpha-4
Synonyms:
CD49 antigen-like family member D CD49d antigen ITA4_HUMAN Integrin alpha-4 Integrin alpha-IV VLA-4 integrin alpha 4 precursor | integrin alpha-4 precursor
Type:
Membrane Protein
Mol. Mass.:
114897.35
Organism:
Homo sapiens (Human)
Description:
P13612
Residue:
1032
  
Inhibitor
Name:
BDBM50326000
Synonyms:
(S)-6-((R)-1-amino-1-oxo-3-phenylpropan-2-ylamino)-6-oxo-5-((S)-6-((E)-3-(pyridin-3-yl)acrylamido)-2-(2-(4-(3-o-tolylureido)phenyl)acetamido)hexanamido)hexanoic acid | CHEMBL1241140
Type:
Small organic molecule
Emp. Form.:
C45H52N8O8
Mol. Mass.:
832.9432
SMILES:
Cc1ccccc1NC(=O)Nc1ccc(CC(=O)N[C@@H](CCCCNC(=O)\C=C\c2cccnc2)C(=O)N[C@@H](CCCC(O)=O)C(=O)N[C@H](Cc2ccccc2)C(N)=O)cc1
: