Target
ATP-dependent translocase ABCB1
Ligand
BDBM50423799
Substrate
Meas. Tech.
ChEMBL_765932 (CHEMBL1827948)
Kd
339±n/a nM
Citation
 Kothandan, GGadhe, CGMadhavan, TChoi, CHCho, SJ Docking and 3D-QSAR (quantitative structure activity relationship) studies of flavones, the potent inhibitors of p-glycoprotein targeting the nucleotide binding domain. Eur J Med Chem 46:4078-88 (2011)  
Target
Name:
ATP-dependent translocase ABCB1
Synonyms:
ABCB1 MDR1_HUMAN Multidrug resistance protein 1 P-glycoprotein (P-gp) PGY1
Type:
Protein
Mol. Mass.:
141503.50
Organism:
Homo sapiens (Human)
Description:
P08183
Residue:
1280
  
Inhibitor
Name:
BDBM50423799
Synonyms:
CHEMBL165452
Type:
Small organic molecule
Emp. Form.:
C22H16O4
Mol. Mass.:
344.36
SMILES:
Oc1cc2oc(cc(=O)c2c(O)c1Cc1ccccc1)-c1ccccc1
: