Target
Beta-2 adrenergic receptor
Ligand
BDBM50423820
Substrate
Meas. Tech.
ChEMBL_770398 (CHEMBL1833707)
Kd
5.8±n/a nM
Citation
 Baker, JGAdams, LASalchow, KMistry, SNMiddleton, RJHill, SJKellam, B Synthesis and characterization of high-affinity 4,4-difluoro-4-bora-3a,4a-diaza-s-indacene-labeled fluorescent ligands for humanß-adrenoceptors. J Med Chem 54:6874-87 (2011)  
Target
Name:
Beta-2 adrenergic receptor
Synonyms:
ADRB2 ADRB2_HUMAN Beta-2 adrenoceptor | Beta-2 adrenoreceptor
Type:
Mol. Mass.:
46461.69
Organism:
Homo sapiens (Human)
Description:
P07550
Residue:
413
  
Inhibitor
Name:
BDBM50423820
Synonyms:
CHEMBL1830487
Type:
Small organic molecule
Emp. Form.:
C50H58BF2N5O5S
Mol. Mass.:
889.899
SMILES:
O[C@@H](CNCCCCCCCCNC(=O)CCCCCNC(=O)COc1ccc(\C=C\c2ccc3C=C4C=CC(c5cccs5)=[N+]4[B-](F)(F)n23)cc1)COc1cccc2ccccc12
: