Target
Beta-1 adrenergic receptor
Ligand
BDBM50423827
Substrate
Meas. Tech.
ChEMBL_770397 (CHEMBL1833706)
Kd
17±n/a nM
Citation
 Baker, JGAdams, LASalchow, KMistry, SNMiddleton, RJHill, SJKellam, B Synthesis and characterization of high-affinity 4,4-difluoro-4-bora-3a,4a-diaza-s-indacene-labeled fluorescent ligands for humanß-adrenoceptors. J Med Chem 54:6874-87 (2011)  
Target
Name:
Beta-1 adrenergic receptor
Synonyms:
ADRB1 ADRB1_HUMAN Beta-1 adrenoceptor adrenergic Beta1
Type:
G Protein-Coupled Receptor (GPCR)
Mol. Mass.:
51338.40
Organism:
Homo sapiens (Human)
Description:
P08588
Residue:
477
  
Inhibitor
Name:
BDBM50423827
Synonyms:
CHEMBL1830491
Type:
Small organic molecule
Emp. Form.:
C48H54BF2N5O7S
Mol. Mass.:
893.844
SMILES:
O[C@@H](CNCCOCCOCCNC(=O)CCCCCNC(=O)COc1ccc(\C=C\c2ccc3C=C4C=CC(c5cccs5)=[N+]4[B-](F)(F)n23)cc1)COc1cccc2ccccc12
: