Target
Emopamil-binding protein-like
Ligand
BDBM20607
Substrate
Meas. Tech.
ChEMBL_936215 (CHEMBL2320419)
Ki
2.8±n/a nM
Citation
 Wang, XLi, YDeuther-Conrad, WXie, FChen, XCui, MCZhang, XJZhang, JMSteinbach, JBrust, PLiu, BLJia, HM Synthesis and biological evaluation of¹8F labeled fluoro-oligo-ethoxylated 4-benzylpiperazine derivatives for sigma-1 receptor imaging. Bioorg Med Chem 21:215-22 (2012)  
Target
Name:
Emopamil-binding protein-like
Synonyms:
EBPL EBRP Emopamil-binding-related protein
Type:
PROTEIN
Mol. Mass.:
23203.44
Organism:
Homo sapiens (Human)
Description:
ChEMBL_936215
Residue:
206
  
Inhibitor
Name:
BDBM20607
Synonyms:
(2-{4-[(1Z)-1,2-diphenylbut-1-en-1-yl]phenoxy}ethyl)dimethylamine CHEMBL83 NCGC00024928 Tamoxifen Tamoxifen, 7 med.21724, Compound Tamoxifen
Type:
Small organic molecule
Emp. Form.:
C26H29NO
Mol. Mass.:
371.5146
SMILES:
CC\C(=C(/c1ccccc1)c1ccc(OCCN(C)C)cc1)c1ccccc1
: