Target
Muscarinic acetylcholine receptor M3
Ligand
BDBM50356969
Substrate
Meas. Tech.
ChEMBL_937332 (CHEMBL2319366)
EC50
>30000±n/a nM
Citation
 Sheffler, DJSevel, CLe, ULovell, KMTarr, JCCarrington, SJCho, HPDigby, GJNiswender, CMConn, PJHopkins, CRWood, MRLindsley, CW Further exploration of M1 allosteric agonists: subtle structural changes abolish M1 allosteric agonism and result in pan-mAChR orthosteric antagonism. Bioorg Med Chem Lett 23:223-7 (2012)  
Target
Name:
Muscarinic acetylcholine receptor M3
Synonyms:
ACM3_RAT Chrm-3 | Chrm3
Type:
Enzyme Catalytic Domain
Mol. Mass.:
66086.66
Organism:
RAT
Description:
Cholinergic, muscarinic M3 CHRM3 RAT::P08483
Residue:
589
  
Inhibitor
Name:
BDBM50356969
Synonyms:
CHEMBL1916226
Type:
Small organic molecule
Emp. Form.:
C20H29N3O3
Mol. Mass.:
359.4626
SMILES:
CCOC(=O)N1CCC(CC1)N1CCC[C@H](C1)NC(=O)c1ccccc1
: