Target
Interleukin-5
Ligand
BDBM50424124
Substrate
Meas. Tech.
ChEMBL_937647 (CHEMBL2321339)
IC50
6700±n/a nM
Citation
 Venkateswararao, EKim, MSSharma, VKLee, KCSubramanian, SRoh, EKim, YJung, SH Identification of novel chromenone derivatives as interleukin-5 inhibitors. Eur J Med Chem 59:31-8 (2013)  
Target
Name:
Interleukin-5
Synonyms:
IL5_MOUSE Il5
Type:
PROTEIN
Mol. Mass.:
15414.97
Organism:
Mus musculus
Description:
ChEMBL_1464308
Residue:
133
  
Inhibitor
Name:
BDBM50424124
Synonyms:
CHEMBL2316357
Type:
Small organic molecule
Emp. Form.:
C26H25NO4
Mol. Mass.:
415.481
SMILES:
OC(\C=C\c1coc2cccc(OCC3CCCCC3)c2c1=O)c1ccc(cc1)C#N
: