Target
Induced myeloid leukemia cell differentiation protein Mcl-1
Ligand
BDBM50424209
Substrate
Meas. Tech.
ChEMBL_934036 (CHEMBL2318343)
Kd
105±n/a nM
Citation
 Song, TLi, XChang, XLiang, XZhao, YWu, GXie, SSu, PWu, ZFeng, YZhang, Z 3-Thiomorpholin-8-oxo-8H-acenaphtho [1,2-b] pyrrole-9-carbonitrile (S1) derivatives as pan-Bcl-2-inhibitors of Bcl-2, Bcl-xL and Mcl-1. Bioorg Med Chem 21:11-20 (2012)  
Target
Name:
Induced myeloid leukemia cell differentiation protein Mcl-1
Synonyms:
BCL2L3 Bcl-2-like protein 3 (Mcl-1) Bcl2-L-3 MCL1 Mcl-1 Myeloid cell leukemia sequence 1 (BCL2-related) | mcl1/EAT
Type:
Membrane; Single-pass membrane protein
Mol. Mass.:
37332.87
Organism:
Homo sapiens (Human)
Description:
Q07820
Residue:
350
  
Inhibitor
Name:
BDBM50424209
Synonyms:
CHEMBL2312470
Type:
Small organic molecule
Emp. Form.:
C29H23N3OS
Mol. Mass.:
461.577
SMILES:
Nc1ccc(Sc2ccc3c4c(NCCCc5ccccc5)c(=O)nc4c4cccc2c34)cc1
: