Target
Ricin
Ligand
BDBM50424237
Substrate
Meas. Tech.
ChEMBL_934991 (CHEMBL2320360)
IC50
90000±n/a nM
Citation
 Saito, RPruet, JMManzano, LAJasheway, KMonzingo, AFWiget, PAKamat, IAnslyn, EVRobertus, JD Peptide-conjugated pterins as inhibitors of ricin toxin A. J Med Chem 56:320-9 (2013)  
Target
Name:
Ricin
Synonyms:
RICI_RICCO
Type:
PROTEIN
Mol. Mass.:
64090.82
Organism:
Ricinus communis
Description:
ChEMBL_1286970
Residue:
576
  
Inhibitor
Name:
BDBM50424237
Synonyms:
CHEMBL2314128
Type:
Small organic molecule
Emp. Form.:
C19H19N7O6
Mol. Mass.:
441.3975
SMILES:
Nc1nc2nc(cnc2c(=O)[nH]1)C(=O)N[C@@H](CO)C(=O)N[C@@H](Cc1ccccc1)C(O)=O
: