Target
Dual specificity tyrosine-phosphorylation-regulated kinase 1A
Ligand
BDBM50424260
Substrate
Meas. Tech.
ChEMBL_935027 (CHEMBL2320633)
IC50
2000±n/a nM
Citation
 Demange, LAbdellah, FNLozach, OFerandin, YGresh, NMeijer, LGalons, H Potent inhibitors of CDK5 derived from roscovitine: synthesis, biological evaluation and molecular modelling. Bioorg Med Chem Lett 23:125-31 (2012)  
Target
Name:
Dual specificity tyrosine-phosphorylation-regulated kinase 1A
Synonyms:
DYR1A_HUMAN DYRK1A Dual specificity YAK1-related kinase 1A (Dyrk1A) Dual-specificity tyrosine-phosphorylation regulated kinase 1A HP86 MNBH
Type:
Enzyme
Mol. Mass.:
85616.61
Organism:
Homo sapiens (Human)
Description:
Q13627
Residue:
763
  
Inhibitor
Name:
BDBM50424260
Synonyms:
CHEMBL2314461
Type:
Small organic molecule
Emp. Form.:
C16H22N8O
Mol. Mass.:
342.3989
SMILES:
CC[C@@H](CO)Nc1nc(Nc2ncccn2)c2ncn(C(C)C)c2n1
: