Target
Dual specificity tyrosine-phosphorylation-regulated kinase 1A
Ligand
BDBM50424273
Substrate
Meas. Tech.
ChEMBL_935027 (CHEMBL2320633)
IC50
2100±n/a nM
Citation
 Demange, LAbdellah, FNLozach, OFerandin, YGresh, NMeijer, LGalons, H Potent inhibitors of CDK5 derived from roscovitine: synthesis, biological evaluation and molecular modelling. Bioorg Med Chem Lett 23:125-31 (2012)  
Target
Name:
Dual specificity tyrosine-phosphorylation-regulated kinase 1A
Synonyms:
DYR1A_HUMAN DYRK1A Dual specificity YAK1-related kinase 1A (Dyrk1A) Dual-specificity tyrosine-phosphorylation regulated kinase 1A HP86 MNBH
Type:
Enzyme
Mol. Mass.:
85616.61
Organism:
Homo sapiens (Human)
Description:
Q13627
Residue:
763
  
Inhibitor
Name:
BDBM50424273
Synonyms:
CHEMBL2314474
Type:
Small organic molecule
Emp. Form.:
C13H13ClN6
Mol. Mass.:
288.736
SMILES:
CC(C)n1cnc2c(Nc3cccnc3)nc(Cl)nc12
: