Target
Dual specificity tyrosine-phosphorylation-regulated kinase 1A
Ligand
BDBM50424277
Substrate
Meas. Tech.
ChEMBL_935027 (CHEMBL2320633)
IC50
3300±n/a nM
Citation
 Demange, LAbdellah, FNLozach, OFerandin, YGresh, NMeijer, LGalons, H Potent inhibitors of CDK5 derived from roscovitine: synthesis, biological evaluation and molecular modelling. Bioorg Med Chem Lett 23:125-31 (2012)  
Target
Name:
Dual specificity tyrosine-phosphorylation-regulated kinase 1A
Synonyms:
DYR1A_HUMAN DYRK1A Dual specificity YAK1-related kinase 1A (Dyrk1A) Dual-specificity tyrosine-phosphorylation regulated kinase 1A HP86 MNBH
Type:
Enzyme
Mol. Mass.:
85616.61
Organism:
Homo sapiens (Human)
Description:
Q13627
Residue:
763
  
Inhibitor
Name:
BDBM50424277
Synonyms:
CHEMBL2314478
Type:
Small organic molecule
Emp. Form.:
C17H23N7O
Mol. Mass.:
341.4108
SMILES:
CC[C@H](CO)Nc1nc(Nc2ccccn2)c2ncn(C(C)C)c2n1
: