Target
Prostaglandin E2 receptor EP1 subtype
Ligand
BDBM50424390
Substrate
Meas. Tech.
ChEMBL_935622 (CHEMBL2320404)
Kd
302±n/a nM
Citation
 Downey, JDSaleh, SABridges, TMMorrison, RDScott Daniels, JLindsley, CWBreyer, RM Development of an in vivo active, dual EP1 and EP3 selective antagonist based on a novel acyl sulfonamide bioisostere. Bioorg Med Chem Lett 23:37-41 (2012)  
Target
Name:
Prostaglandin E2 receptor EP1 subtype
Synonyms:
PE2R1_MOUSE Prostaglandin E1 Prostanoid EP1 receptor Ptgerep1
Type:
G-protein coupled receptor
Mol. Mass.:
43000.62
Organism:
Mus musculus (Mouse)
Description:
Residue:
405
  
Inhibitor
Name:
BDBM50424390
Synonyms:
CHEMBL2315049
Type:
Small organic molecule
Emp. Form.:
C24H23Cl2FN2O2
Mol. Mass.:
461.356
SMILES:
CC(C)CNC(=O)c1cccc(Cc2cc(Cl)ccc2OCc2ccc(Cl)cc2F)n1
: