Target
DNA repair protein RAD51 homolog 1
Ligand
BDBM50424500
Substrate
Meas. Tech.
ChEMBL_937387 (CHEMBL2319671)
IC50
1400±n/a nM
Citation
 Budke, BKalin, JHPawlowski, MZelivianskaia, ASWu, MKozikowski, APConnell, PP An optimized RAD51 inhibitor that disrupts homologous recombination without requiring Michael acceptor reactivity. J Med Chem 56:254-63 (2013)  
Target
Name:
DNA repair protein RAD51 homolog 1
Synonyms:
RAD51 RAD51_HUMAN | RECA
Type:
Enzyme Catalytic Domain
Mol. Mass.:
36960.74
Organism:
Homo sapiens (Human)
Description:
gi_49168602
Residue:
339
  
Inhibitor
Name:
BDBM50424500
Synonyms:
CHEMBL2316721
Type:
Small organic molecule
Emp. Form.:
C16H9Cl3N2O2
Mol. Mass.:
367.614
SMILES:
Nc1ccc(cc1)C1=C(Cl)C(=O)N(C1=O)c1ccc(Cl)c(Cl)c1
: