Target
Multidrug and toxin extrusion protein 2
Ligand
BDBM29568
Substrate
Meas. Tech.
ChEMBL_934318 (CHEMBL2320304)
IC50
38400±n/a nM
Citation
 Wittwer, MBZur, AAKhuri, NKido, YKosaka, AZhang, XMorrissey, KMSali, AHuang, YGiacomini, KM Discovery of potent, selective multidrug and toxin extrusion transporter 1 (MATE1, SLC47A1) inhibitors through prescription drug profiling and computational modeling. J Med Chem 56:781-95 (2013)  
Target
Name:
Multidrug and toxin extrusion protein 2
Synonyms:
Kidney-specific H(+)/organic cation antiporter MATE2 SLC47A2 hMATE-2
Type:
PROTEIN
Mol. Mass.:
65098.38
Organism:
Homo sapiens (Human)
Description:
ChEMBL_934314
Residue:
602
  
Inhibitor
Name:
BDBM29568
Synonyms:
CHEMBL2 PRAZOSIN HYDROCHLORIDE [3H]-Minipress [3H]-Prazosin
Type:
radiolabeled ligand
Emp. Form.:
C19H21N5O4
Mol. Mass.:
383.4011
SMILES:
COc1cc2nc(nc(N)c2cc1OC)N1CCN(CC1)C(=O)c1ccco1
: