Target
Multidrug and toxin extrusion protein 1
Ligand
BDBM50151866
Substrate
Meas. Tech.
ChEMBL_934312 (CHEMBL2320298)
IC50
650±n/a nM
Citation
 Wittwer, MBZur, AAKhuri, NKido, YKosaka, AZhang, XMorrissey, KMSali, AHuang, YGiacomini, KM Discovery of potent, selective multidrug and toxin extrusion transporter 1 (MATE1, SLC47A1) inhibitors through prescription drug profiling and computational modeling. J Med Chem 56:781-95 (2013)  
Target
Name:
Multidrug and toxin extrusion protein 1
Synonyms:
MATE-1 S47A1_HUMAN Solute carrier family 47 member 1 | hMATE-1
Type:
PROTEIN
Mol. Mass.:
61928.01
Organism:
Homo sapiens (Human)
Description:
ChEMBL_934313
Residue:
570
  
Inhibitor
Name:
BDBM50151866
Synonyms:
6-(2-{(2-Hydroxy-ethyl)-[3-(4-nitro-phenyl)-propyl]-amino}-ethylamino)-1,3-dimethyl-1H-pyrimidine-2,4-dione Nifekalant
Type:
Small organic molecule
Emp. Form.:
C19H27N5O5
Mol. Mass.:
405.4482
SMILES:
Cn1c(NCCN(CCO)CCCc2ccc(cc2)[N+]([O-])=O)cc(=O)n(C)c1=O
: